MARC Code List for Relators
type: ConceptScheme
comment: Relator terms and their associated codes designate the relationship between a name and a bibliographic resource. The relator codes are three-character lowercase alphabetic strings that serve as identifiers. Either the term or the code may be used as controlled values.
has top concept: Actor
has top concept: Adapter
has top concept: Analyst
has top concept: Animator
has top concept: Annotator
has top concept: Applicant
has top concept: Architect
has top concept: Arranger
has top concept: Art copyist
has top concept: Artist
has top concept: Artistic director
has top concept: Assignee
has top concept: Associated name
has top concept: Attributed name
has top concept: Auctioneer
has top concept: Author
has top concept: Author in quotations or text extracts
has top concept: Author of afterword, colophon, etc.
has top concept: Author of dialog
has top concept: Author of introduction, etc.
has top concept: Author of screenplay, etc.
has top concept: Bibliographic antecedent
has top concept: Binder
has top concept: Binding designer
has top concept: Blurb writer
has top concept: Book designer
has top concept: Book producer
has top concept: Bookjacket designer
has top concept: Bookplate designer
has top concept: Bookseller
has top concept: Calligrapher
has top concept: Cartographer
has top concept: Censor
has top concept: Choreographer
has top concept: Cinematographer
has top concept: Client
has top concept: Collaborator
has top concept: Collector
has top concept: Collotyper
has top concept: Colorist
has top concept: Commentator
has top concept: Commentator for written text
has top concept: Compiler
has top concept: Complainant
has top concept: Complainant-appellant
has top concept: Complainant-appellee
has top concept: Composer
has top concept: Compositor
has top concept: Conceptor
has top concept: Conductor
has top concept: Conservator
has top concept: Consultant
has top concept: Consultant to a project
has top concept: Contestant
has top concept: Contestant-appellant
has top concept: Contestant-appellee
has top concept: Contestee
has top concept: Contestee-appellant
has top concept: Contestee-appellee
has top concept: Contractor
has top concept: Contributor
has top concept: Copyright claimant
has top concept: Copyright holder
has top concept: Corrector
has top concept: Correspondent
has top concept: Costume designer
has top concept: Cover designer
has top concept: Creator
has top concept: Curator of an exhibition
has top concept: Dancer
has top concept: Data contributor
has top concept: Data manager
has top concept: Dedicatee
has top concept: Dedicator
has top concept: Defendant
has top concept: Defendant-appellant
has top concept: Defendant-appellee

Actor
type: Concept
type: Property
notation: act @zxx
scope note: Use for a person or organization who principally exhibits acting skills in a musical or dramatic presentation or entertainment.
in scheme: MARC Code List for Relators
term status: stable
sub property of: contributor

Adapter
type: Concept
type: Property
notation: adp @zxx
scope note: Use for a person or organization who 1) reworks a musical composition, usually for a different medium, or 2) rewrites novels or stories for motion pictures or other audiovisual medium.
in scheme: MARC Code List for Relators
term status: stable
sub property of: contributor

Analyst
type: Concept
type: Property
notation: anl @zxx
scope note: Use for a person or organization that reviews, examines and interprets data or information in a specific area.
in scheme: MARC Code List for Relators
term status: stable

Animator
type: Concept
type: Property
notation: anm @zxx
scope note: Use for a person or organization who draws the two-dimensional figures, manipulates the three dimensional objects and/or also programs the computer to move objects and images for the purpose of animated film processing. Animation cameras, stands, celluloid screens, transparencies and inks are some of the tools of the animator.
in scheme: MARC Code List for Relators
term status: stable
sub property of: contributor

Annotator
type: Concept
type: Property
notation: ann @zxx
scope note: Use for a person who writes manuscript annotations on a printed item.
in scheme: MARC Code List for Relators
term status: stable
sub property of: contributor

Applicant
type: Concept
type: Property
notation: app @zxx
scope note: Use for a person or organization responsible for the submission of an application or who is named as eligible for the results of the processing of the application (e.g., bestowing of rights, reward, title, position).
in scheme: MARC Code List for Relators
term status: stable

Architect
type: Concept
type: Property
notation: arc @zxx
scope note: Use for a person or organization who designs structures or oversees their construction.
in scheme: MARC Code List for Relators
term status: stable
sub property of: contributor

Arranger
type: Concept
type: Property
notation: arr @zxx
scope note: Use for a person or organization who transcribes a musical composition, usually for a different medium from that of the original; in an arrangement the musical substance remains essentially unchanged.
in scheme: MARC Code List for Relators
term status: stable
sub property of: contributor

Art copyist
type: Concept
type: Property
notation: acp @zxx
scope note: Use for a person (e.g., a painter or sculptor) who makes copies of works of visual art.
in scheme: MARC Code List for Relators
term status: stable

Artist
type: Concept
type: Property
notation: art @zxx
scope note: Use for a person (e.g., a painter) or organization who conceives, and perhaps also implements, an original graphic design or work of art, if specific codes (e.g., [egr], [etr]) are not desired. For book illustrators, prefer Illustrator [ill].
in scheme: MARC Code List for Relators
term status: stable
alternative label: Graphic technician
note: Relator term "Graphic technician" (coded [grt]) used before March 1988 only.
sub property of: contributor

Artistic director
type: Concept
type: Property
notation: ard @zxx
scope note: Use for a person responsible for controlling the development of the artistic style of an entire production, including the choice of works to be presented and selection of senior production staff.
in scheme: MARC Code List for Relators
term status: stable

Assignee
type: Concept
type: Property
notation: asg @zxx
scope note: Use for a person or organization to whom a license for printing or publishing has been transferred.
in scheme: MARC Code List for Relators
term status: stable

Associated name
type: Concept
type: Property
notation: asn @zxx
scope note: Use for a person or organization associated with or found in an item or collection, which cannot be determined to be that of a Former owner [fmo] or other designated relator indicative of provenance.
in scheme: MARC Code List for Relators
term status: stable

Attributed name
type: Concept
type: Property
notation: att @zxx
scope note: Use for an author, artist, etc., relating him/her to a work for which there is or once was substantial authority for designating that person as author, creator, etc. of the work.
in scheme: MARC Code List for Relators
term status: stable
alternative label: Supposed name

Auctioneer
type: Concept
type: Property
notation: auc @zxx
scope note: Use for a person or organization in charge of the estimation and public auctioning of goods, particularly books, artistic works, etc.
in scheme: MARC Code List for Relators
term status: stable

Author
type: Concept
type: Property
notation: aut @zxx
scope note: Use for a person or organization chiefly responsible for the intellectual or artistic content of a work, usually printed text. This term may also be used when more than one person or body bears such responsibility.
in scheme: MARC Code List for Relators
term status: stable
alternative label: Joint author
sub property of: contributor

Author in quotations or text extracts
type: Concept
type: Property
notation: aqt @zxx
scope note: Use for a person or organization whose work is largely quoted or extracted in works to which he or she did not contribute directly. Such quotations are found particularly in exhibition catalogs, collections of photographs, etc.
in scheme: MARC Code List for Relators
term status: stable
sub property of: contributor

Author of afterword, colophon, etc.
type: Concept
type: Property
notation: aft @zxx
scope note: Use for a person or organization responsible for an afterword, postface, colophon, etc. but who is not the chief author of a work.
in scheme: MARC Code List for Relators
term status: stable
sub property of: contributor

Author of dialog
type: Concept
type: Property
notation: aud @zxx
scope note: Use for a person or organization responsible for the dialog or spoken commentary for a screenplay or sound recording.
in scheme: MARC Code List for Relators
term status: stable
sub property of: contributor

Author of introduction, etc.
type: Concept
type: Property
notation: aui @zxx
scope note: Use for a person or organization responsible for an introduction, preface, foreword, or other critical introductory matter, but who is not the chief author.
in scheme: MARC Code List for Relators
term status: stable
sub property of: contributor

Author of screenplay, etc.
type: Concept
type: Property
notation: aus @zxx
scope note: Use for a person or organization responsible for a motion picture screenplay, dialog, spoken commentary, etc.
in scheme: MARC Code List for Relators
term status: stable
sub property of: contributor

Bibliographic antecedent
type: Concept
type: Property
notation: ant @zxx
scope note: Use for a person or organization responsible for a work upon which the work represented by the catalog record is based. This may be appropriate for adaptations, sequels, continuations, indexes, etc.
in scheme: MARC Code List for Relators
term status: stable

Binder
type: Concept
type: Property
notation: bnd @zxx
scope note: Use for a person or organization responsible for the binding of printed or manuscript materials.
in scheme: MARC Code List for Relators
term status: stable

Binding designer
type: Concept
type: Property
notation: bdd @zxx
scope note: Use for a person or organization responsible for the binding design of a book, including the type of binding, the type of materials used, and any decorative aspects of the binding.
in scheme: MARC Code List for Relators
term status: stable
alternative label: Designer of binding

Blurb writer
type: Concept
type: Property
notation: blw @zxx
scope note: Use for the named entity responsible for writing a commendation or testimonial for a work, which appears on or within the publication itself, frequently on the back or dust jacket of print publications or on advertising material for all media.
in scheme: MARC Code List for Relators
term status: stable

Book designer
type: Concept
type: Property
notation: bkd @zxx
scope note: Use for a person or organization responsible for the entire graphic design of a book, including arrangement of type and illustration, choice of materials, and process used.
in scheme: MARC Code List for Relators
term status: stable
alternative label: Designer of book

Book producer
type: Concept
type: Property
notation: bkp @zxx
scope note: Use for a person or organization responsible for the production of books and other print media, if specific codes (e.g., [bkd], [egr], [tyd], [prt]) are not desired.
in scheme: MARC Code List for Relators
term status: stable
alternative label: Producer of book

Bookjacket designer
type: Concept
type: Property
notation: bjd @zxx
scope note: Use for a person or organization responsible for the design of flexible covers designed for or published with a book, including the type of materials used, and any decorative aspects of the bookjacket.
in scheme: MARC Code List for Relators
term status: stable
alternative label: Designer of bookjacket

Bookplate designer
type: Concept
type: Property
notation: bpd @zxx
scope note: Use for a person or organization responsible for the design of a book owner's identification label that is most commonly pasted to the inside front cover of a book.
in scheme: MARC Code List for Relators
term status: stable
alternative label: Designer of bookplate

Bookseller
type: Concept
type: Property
notation: bsl @zxx
scope note: Use for a person or organization who makes books and other bibliographic materials available for purchase. Interest in the materials is primarily lucrative.
in scheme: MARC Code List for Relators
term status: stable

Calligrapher
type: Concept
type: Property
notation: cll @zxx
scope note: Use for a person or organization who writes in an artistic hand, usually as a copyist and or engrosser.
in scheme: MARC Code List for Relators
term status: stable
sub property of: contributor

Cartographer
type: Concept
type: Property
notation: ctg @zxx
scope note: Use for a person or organization responsible for the creation of maps and other cartographic materials.
in scheme: MARC Code List for Relators
term status: stable
sub property of: contributor

Censor
type: Concept
type: Property
notation: cns @zxx
scope note: Use for a censor, bowdlerizer, expurgator, etc., official or private.
in scheme: MARC Code List for Relators
term status: stable
alternative label: Bowdlerizer
alternative label: Expurgator

Choreographer
type: Concept
type: Property
notation: chr @zxx
scope note: Use for a person or organization who composes or arranges dances or other movements (e.g., "master of swords") for a musical or dramatic presentation or entertainment.
in scheme: MARC Code List for Relators
term status: stable
sub property of: contributor

Cinematographer
type: Concept
type: Property
notation: cng @zxx
scope note: Use for a person or organization who is in charge of the images captured for a motion picture film. The cinematographer works under the supervision of a director, and may also be referred to as director of photography. Do not confuse with videographer.
in scheme: MARC Code List for Relators
term status: stable
sub property of: contributor

Client
type: Concept
type: Property
notation: cli @zxx
scope note: Use for a person or organization for whom another person or organization is acting.
in scheme: MARC Code List for Relators
term status: stable

Collaborator
type: Concept
type: Property
notation: clb @zxx
scope note: Use for a person or organization that takes a limited part in the elaboration of a work of another person or organization that brings complements (e.g., appendices, notes) to the work.
in scheme: MARC Code List for Relators
term status: stable
sub property of: contributor

Collector
type: Concept
type: Property
notation: col @zxx
scope note: Use for a person or organization who has brought together material from various sources that has been arranged, described, and cataloged as a collection. A collector is neither the creator of the material nor a person to whom manuscripts in the collection may have been addressed.
in scheme: MARC Code List for Relators
term status: stable

Collotyper
type: Concept
type: Property
notation: clt @zxx
scope note: Use for a person or organization responsible for the production of photographic prints from film or other colloid that has ink-receptive and ink-repellent surfaces.
in scheme: MARC Code List for Relators
term status: stable
sub property of: contributor

Colorist
type: Concept
type: Property
notation: clr @zxx
scope note: Use for the named entity responsible for applying color to drawings, prints, photographs, maps, moving images, etc.
in scheme: MARC Code List for Relators
term status: stable

Commentator
type: Concept
type: Property
notation: cmm @zxx
scope note: Use for a person or organization who provides interpretation, analysis, or a discussion of the subject matter on a recording, motion picture, or other audiovisual medium.
in scheme: MARC Code List for Relators
term status: stable
sub property of: contributor

Commentator for written text
type: Concept
type: Property
notation: cwt @zxx
scope note: Use for a person or organization responsible for the commentary or explanatory notes about a text. For the writer of manuscript annotations in a printed book, use Annotator [ann].
in scheme: MARC Code List for Relators
term status: stable
sub property of: contributor

Compiler
type: Concept
type: Property
notation: com @zxx
scope note: Use for a person or organization who produces a work or publication by selecting and putting together material from the works of various persons or bodies.
in scheme: MARC Code List for Relators
term status: stable
sub property of: contributor

Complainant
type: Concept
type: Property
notation: cpl @zxx
scope note: Use for the party who applies to the courts for redress, usually in an equity proceeding.
in scheme: MARC Code List for Relators
term status: stable

Complainant-appellant
type: Concept
type: Property
notation: cpt @zxx
scope note: Use for a complainant who takes an appeal from one court or jurisdiction to another to reverse the judgment, usually in an equity proceeding.
in scheme: MARC Code List for Relators
term status: stable

Complainant-appellee
type: Concept
type: Property
notation: cpe @zxx
scope note: Use for a complainant against whom an appeal is taken from one court or jurisdiction to another to reverse the judgment, usually in an equity proceeding.
in scheme: MARC Code List for Relators
term status: stable

Composer
type: Concept
type: Property
notation: cmp @zxx
scope note: Use for a person or organization who creates a musical work, usually a piece of music in manuscript or printed form.
in scheme: MARC Code List for Relators
term status: stable
sub property of: contributor

Compositor
type: Concept
type: Property
notation: cmt @zxx
scope note: Use for a person or organization responsible for the creation of metal slug, or molds made of other materials, used to produce the text and images in printed matter.
in scheme: MARC Code List for Relators
term status: stable
alternative label: Typesetter

Conceptor
type: Concept
type: Property
notation: ccp @zxx
scope note: Use for a person or organization responsible for the original idea on which a work is based, this includes the scientific author of an audio-visual item and the conceptor of an advertisement.
in scheme: MARC Code List for Relators
term status: stable
sub property of: contributor

Conductor
type: Concept
type: Property
notation: cnd @zxx
scope note: Use for a person who directs a performing group (orchestra, chorus, opera, etc.) in a musical or dramatic presentation or entertainment.
in scheme: MARC Code List for Relators
term status: stable
sub property of: contributor

Conservator
type: Concept
type: Property
notation: con @zxx
scope note: Use for the named entity responsible for documenting, preserving, or treating printed or manuscript material, works of art, artifacts, or other media.
in scheme: MARC Code List for Relators
term status: stable
alternative label: Preservationist

Consultant
type: Concept
type: Property
notation: csl @zxx
scope note: Use for a person or organization relevant to a resource, who is called upon for professional advice or services in a specialized field of knowledge or training.
in scheme: MARC Code List for Relators
term status: stable
sub property of: contributor

Consultant to a project
type: Concept
type: Property
notation: csp @zxx
scope note: Use for a person or organization relevant to a resource, who is engaged specifically to provide an intellectual overview of a strategic or operational task and by analysis, specification, or instruction, to create or propose a cost-effective course of action or solution.
in scheme: MARC Code List for Relators
term status: stable
sub property of: contributor

Contestant
type: Concept
type: Property
notation: cos @zxx
scope note: Use for the party who opposes, resists, or disputes, in a court of law, a claim, decision, result, etc.
in scheme: MARC Code List for Relators
term status: stable

Contestant-appellant
type: Concept
type: Property
notation: cot @zxx
scope note: Use for a contestant who takes an appeal from one court of law or jurisdiction to another to reverse the judgment.
in scheme: MARC Code List for Relators
term status: stable

Contestant-appellee
type: Concept
type: Property
notation: coe @zxx
scope note: Use for a contestant against whom an appeal is taken from one court of law or jurisdiction to another to reverse the judgment.
in scheme: MARC Code List for Relators
term status: stable

Contestee
type: Concept
type: Property
notation: cts @zxx
scope note: Use for the party defending a claim, decision, result, etc. being opposed, resisted, or disputed in a court of law.
in scheme: MARC Code List for Relators
term status: stable

Contestee-appellant
type: Concept
type: Property
notation: ctt @zxx
scope note: Use for a contestee who takes an appeal from one court or jurisdiction to another to reverse the judgment.
in scheme: MARC Code List for Relators
term status: stable

Contestee-appellee
type: Concept
type: Property
notation: cte @zxx
scope note: Use for a contestee against whom an appeal is taken from one court or jurisdiction to another to reverse the judgment.
in scheme: MARC Code List for Relators
term status: stable

Contractor
type: Concept
type: Property
notation: ctr @zxx
scope note: Use for a person or organization relevant to a resource, who enters into a contract with another person or organization to perform a specific task.
in scheme: MARC Code List for Relators
term status: stable
sub property of: contributor

Contributor
type: Concept
type: Property
notation: ctb @zxx
scope note: Use for a person or organization one whose work has been contributed to a larger work, such as an anthology, serial publication, or other compilation of individual works. Do not use if the sole function in relation to a work is as author, editor, compiler or translator.
in scheme: MARC Code List for Relators
term status: stable
sub property of: contributor

Copyright claimant
type: Concept
type: Property
notation: cpc @zxx
scope note: Use for a person or organization listed as a copyright owner at the time of registration. Copyright can be granted or later transferred to another person or organization, at which time the claimant becomes the copyright holder.
in scheme: MARC Code List for Relators
term status: stable

Copyright holder
type: Concept
type: Property
notation: cph @zxx
scope note: Use for a person or organization to whom copy and legal rights have been granted or transferred for the intellectual content of a work. The copyright holder, although not necessarily the creator of the work, usually has the exclusive right to benefit financially from the sale and use of the work to which the associated copyright protection applies.
in scheme: MARC Code List for Relators
term status: stable

Corrector
type: Concept
type: Property
notation: crr @zxx
scope note: Use for a person or organization who is a corrector of manuscripts, such as the scriptorium official who corrected the work of a scribe. For printed matter, use Proofreader [pfr].
in scheme: MARC Code List for Relators
term status: stable

Correspondent
type: Concept
type: Property
notation: crp @zxx
scope note: Use for a person or organization who was either the writer or recipient of a letter or other communication.
in scheme: MARC Code List for Relators
term status: stable
sub property of: contributor

Costume designer
type: Concept
type: Property
notation: cst @zxx
scope note: Use for a person or organization who designs or makes costumes, fixes hair, etc., for a musical or dramatic presentation or entertainment.
in scheme: MARC Code List for Relators
term status: stable
sub property of: contributor

Cover designer
type: Concept
type: Property
notation: cov @zxx
scope note: Use for a person or organization responsible for the graphic design of a book cover, album cover, slipcase, box, container, etc. For a person or organization responsible for the graphic design of an entire book, use Book designer; for book jackets, use Bookjacket designer.
in scheme: MARC Code List for Relators
term status: stable
alternative label: Designer of cover

Creator
type: Concept
type: Property
notation: cre @zxx
scope note: Use for a person or organization responsible for the intellectual or artistic content of a work.
in scheme: MARC Code List for Relators
term status: stable
sub property of: creator
sub property of: contributor

Curator of an exhibition
type: Concept
type: Property
notation: cur @zxx
scope note: Use for a person or organization responsible for conceiving and organizing an exhibition.
in scheme: MARC Code List for Relators
term status: stable
sub property of: contributor

Dancer
type: Concept
type: Property
notation: dnc @zxx
scope note: Use for a person or organization who principally exhibits dancing skills in a musical or dramatic presentation or entertainment.
in scheme: MARC Code List for Relators
term status: stable
sub property of: contributor

Data contributor
type: Concept
type: Property
notation: dtc @zxx
scope note: Use for a person or organization that submits data for inclusion in a database or other collection of data.
in scheme: MARC Code List for Relators
term status: stable

Data manager
type: Concept
type: Property
notation: dtm @zxx
scope note: Use for a person or organization responsible for managing databases or other data sources.
in scheme: MARC Code List for Relators
term status: stable

Dedicatee
type: Concept
type: Property
notation: dte @zxx
scope note: Use for a person or organization to whom a book, manuscript, etc., is dedicated (not the recipient of a gift).
in scheme: MARC Code List for Relators
term status: stable

Dedicator
type: Concept
type: Property
notation: dto @zxx
scope note: Use for the author of a dedication, which may be a formal statement or in epistolary or verse form.
in scheme: MARC Code List for Relators
term status: stable

Defendant
type: Concept
type: Property
notation: dfd @zxx
scope note: Use for the party defending or denying allegations made in a suit and against whom relief or recovery is sought in the courts, usually in a legal action.
in scheme: MARC Code List for Relators
term status: stable

Defendant-appellant
type: Concept
type: Property
notation: dft @zxx
scope note: Use for a defendant who takes an appeal from one court or jurisdiction to another to reverse the judgment, usually in a legal action.
in scheme: MARC Code List for Relators
term status: stable

Defendant-appellee
type: Concept
type: Property
notation: dfe @zxx
scope note: Use for a defendant against whom an appeal is taken from one court or jurisdiction to another to reverse the judgment, usually in a legal action.
in scheme: MARC Code List for Relators
term status: stable

Degree grantor
type: Concept
type: Property
notation: dgg @zxx
scope note: Use for the organization granting a degree for which the thesis or dissertation described was presented.
in scheme: MARC Code List for Relators
term status: stable

Delineator
type: Concept
type: Property
notation: dln @zxx
scope note: Use for a person or organization executing technical drawings from others' designs.
in scheme: MARC Code List for Relators
term status: stable
sub property of: contributor

Depicted
type: Concept
type: Property
notation: dpc @zxx
scope note: Use for an entity depicted or portrayed in a work, particularly in a work of art.
in scheme: MARC Code List for Relators
term status: stable
sub property of: subject

Depositor
type: Concept
type: Property
notation: dpt @zxx
scope note: Use for a person or organization placing material in the physical custody of a library or repository without transferring the legal title.
in scheme: MARC Code List for Relators
term status: stable

Designer
type: Concept
type: Property
notation: dsr @zxx
scope note: Use for a person or organization responsible for the design if more specific codes (e.g., [bkd], [tyd]) are not desired.
in scheme: MARC Code List for Relators
term status: stable
sub property of: contributor

Director
type: Concept
type: Property
notation: drt @zxx
scope note: Use for a person or organization who is responsible for the general management of a work or who supervises the production of a performance for stage, screen, or sound recording.
in scheme: MARC Code List for Relators
term status: stable
sub property of: contributor

Dissertant
type: Concept
type: Property
notation: dis @zxx
scope note: Use for a person who presents a thesis for a university or higher-level educational degree.
in scheme: MARC Code List for Relators
term status: stable
sub property of: contributor

Distribution place
type: Concept
type: Property
notation: dbp @zxx
scope note: Use for the name of a place from which a resource, e.g., a serial, is distributed.
in scheme: MARC Code List for Relators
term status: stable

Distributor
type: Concept
type: Property
notation: dst @zxx
scope note: Use for a person or organization that has exclusive or shared marketing rights for an item.
in scheme: MARC Code List for Relators
term status: stable
sub property of: publisher

Donor
type: Concept
type: Property
notation: dnr @zxx
scope note: Use for a person or organization who is the donor of a book, manuscript, etc., to its present owner. Donors to previous owners are designated as Former owner[fmo] or Inscriber [ins].
in scheme: MARC Code List for Relators
term status: stable

Draftsman
type: Concept
type: Property
notation: drm @zxx
scope note: Use for a person or organization who prepares artistic or technical drawings.
in scheme: MARC Code List for Relators
term status: stable
alternative label: Technical draftsman
sub property of: contributor

Dubious author
type: Concept
type: Property
notation: dub @zxx
scope note: Use for a person or organization to which authorship has been dubiously or incorrectly ascribed.
in scheme: MARC Code List for Relators
term status: stable

Editor
type: Concept
type: Property
notation: edt @zxx
scope note: Use for a person or organization who prepares for publication a work not primarily his/her own, such as by elucidating text, adding introductory or other critical matter, or technically directing an editorial staff.
in scheme: MARC Code List for Relators
term status: stable
sub property of: contributor

Electrician
type: Concept
type: Property
notation: elg @zxx
scope note: Use for a person responsible for setting up a lighting rig and focusing the lights for a production, and running the lighting at a performance.
in scheme: MARC Code List for Relators
term status: stable
alternative label: Chief electrician
alternative label: House electrician
alternative label: Master electrician

Electrotyper
type: Concept
type: Property
notation: elt @zxx
scope note: Use for a person or organization who creates a duplicate printing surface by pressure molding and electrodepositing of metal that is then backed up with lead for printing.
in scheme: MARC Code List for Relators
term status: stable

Engineer
type: Concept
type: Property
notation: eng @zxx
scope note: Use for a person or organization that is responsible for technical planning and design, particularly with construction.
in scheme: MARC Code List for Relators
term status: stable
sub property of: contributor

Engraver
type: Concept
type: Property
notation: egr @zxx
scope note: Use for a person or organization who cuts letters, figures, etc. on a surface, such as a wooden or metal plate, for printing.
in scheme: MARC Code List for Relators
term status: stable
sub property of: contributor

Etcher
type: Concept
type: Property
notation: etr @zxx
scope note: Use for a person or organization who produces text or images for printing by subjecting metal, glass, or some other surface to acid or the corrosive action of some other substance.
in scheme: MARC Code List for Relators
term status: stable
sub property of: contributor

Event place
type: Concept
type: Property
notation: evp @zxx
scope note: Use for the name of the place where an event such as a conference or a concert took place.
in scheme: MARC Code List for Relators
term status: stable

Expert
type: Concept
type: Property
notation: exp @zxx
scope note: Use for a person or organization in charge of the description and appraisal of the value of goods, particularly rare items, works of art, etc.
in scheme: MARC Code List for Relators
term status: stable
alternative label: Appraiser

Facsimilist
type: Concept
type: Property
notation: fac @zxx
scope note: Use for a person or organization that executed the facsimile.
in scheme: MARC Code List for Relators
term status: stable
alternative label: Copier
sub property of: contributor

Field director
type: Concept
type: Property
notation: fld @zxx
scope note: Use for a person or organization that manages or supervises the work done to collect raw data or do research in an actual setting or environment (typically applies to the natural and social sciences).
in scheme: MARC Code List for Relators
term status: stable

Film editor
type: Concept
type: Property
notation: flm @zxx
scope note: Use for a person or organization who is an editor of a motion picture film. This term is used regardless of the medium upon which the motion picture is produced or manufactured (e.g., acetate film, video tape).
in scheme: MARC Code List for Relators
term status: stable
alternative label: Motion picture editor
sub property of: contributor

First party
type: Concept
type: Property
notation: fpy @zxx
scope note: Use for a person or organization who is identified as the only party or the party of the first part. In the case of transfer of right, this is the assignor, transferor, licensor, grantor, etc. Multiple parties can be named jointly as the first party
in scheme: MARC Code List for Relators
term status: stable

Forger
type: Concept
type: Property
notation: frg @zxx
scope note: Use for a person or organization who makes or imitates something of value or importance, especially with the intent to defraud.
in scheme: MARC Code List for Relators
term status: stable
alternative label: Copier
alternative label: Counterfeiter
sub property of: contributor

Former owner
type: Concept
type: Property
notation: fmo @zxx
scope note: Use for a person or organization who owned an item at any time in the past. Includes those to whom the material was once presented. A person or organization giving the item to the present owner is designated as Donor [dnr].
in scheme: MARC Code List for Relators
term status: stable

Funder
type: Concept
type: Property
notation: fnd @zxx
scope note: Use for a person or organization that furnished financial support for the production of the work.
in scheme: MARC Code List for Relators
term status: stable

Geographic information specialist
type: Concept
type: Property
notation: gis @zxx
scope note: Use for a person responsible for geographic information system (GIS) development and integration with global positioning system data..
in scheme: MARC Code List for Relators
term status: stable
alternative label: Geospatial information specialist

Honoree
type: Concept
type: Property
notation: hnr @zxx
scope note: Use for a person or organization in memory or honor of whom a book, manuscript, etc. is donated.
in scheme: MARC Code List for Relators
term status: stable
alternative label: Memorial

Host
type: Concept
type: Property
notation: hst @zxx
scope note: Use for a person who is invited or regularly leads a program (often broadcast) that includes other guests, performers, etc. (e.g., talk show host).
in scheme: MARC Code List for Relators
term status: stable
sub property of: contributor

Illuminator
type: Concept
type: Property
notation: ilu @zxx
scope note: Use for a person or organization responsible for the decoration of a work (especially manuscript material) with precious metals or color, usually with elaborate designs and motifs.
in scheme: MARC Code List for Relators
term status: stable
sub property of: contributor

Illustrator
type: Concept
type: Property
notation: ill @zxx
scope note: Use for a person or organization who conceives, and perhaps also implements, a design or illustration, usually to accompany a written text.
in scheme: MARC Code List for Relators
term status: stable
sub property of: contributor

Inscriber
type: Concept
type: Property
notation: ins @zxx
scope note: Use for a person who signs a presentation statement.
in scheme: MARC Code List for Relators
term status: stable

Instrumentalist
type: Concept
type: Property
notation: itr @zxx
scope note: Use for a person or organization who principally plays an instrument in a musical or dramatic presentation or entertainment.
in scheme: MARC Code List for Relators
term status: stable
sub property of: contributor

Interviewee
type: Concept
type: Property
notation: ive @zxx
scope note: Use for a person or organization who is interviewed at a consultation or meeting, usually by a reporter, pollster, or some other information gathering agent.
in scheme: MARC Code List for Relators
term status: stable
sub property of: contributor

Interviewer
type: Concept
type: Property
notation: ivr @zxx
scope note: Use for a person or organization who acts as a reporter, pollster, or other information gathering agent in a consultation or meeting involving one or more individuals.
in scheme: MARC Code List for Relators
term status: stable
sub property of: contributor

Inventor
type: Concept
type: Property
notation: inv @zxx
scope note: Use for a person or organization who first produces a particular useful item, or develops a new process for obtaining a known item or result.
in scheme: MARC Code List for Relators
term status: stable
sub property of: contributor

Laboratory
type: Concept
type: Property
notation: lbr @zxx
scope note: Use for an institution that provides scientific analyses of material samples.
in scheme: MARC Code List for Relators
term status: stable

Laboratory director
type: Concept
type: Property
notation: ldr @zxx
scope note: Use for a person or organization that manages or supervises work done in a controlled setting or environment.
in scheme: MARC Code List for Relators
term status: stable
alternative label: Lab director

Lead
type: Concept
type: Property
notation: led @zxx
scope note: Use to indicate that a person or organization takes primary responsibility for a particular activity or endeavor. Use with another relator term or code to show the greater importance this person or organization has regarding that particular role. If more than one relator is assigned to a heading, use the Lead relator only if it applies to all the relators.
in scheme: MARC Code List for Relators
term status: stable

Landscape architect
type: Concept
type: Property
notation: lsa @zxx
scope note: Use for a person or organization whose work involves coordinating the arrangement of existing and proposed land features and structures.
in scheme: MARC Code List for Relators
term status: stable
sub property of: contributor

Lender
type: Concept
type: Property
notation: len @zxx
scope note: Use for a person or organization permitting the temporary use of a book, manuscript, etc., such as for photocopying or microfilming.
in scheme: MARC Code List for Relators
term status: stable

Libelant
type: Concept
type: Property
notation: lil @zxx
scope note: Use for the party who files a libel in an ecclesiastical or admiralty case.
in scheme: MARC Code List for Relators
term status: stable

Libelant-appellant
type: Concept
type: Property
notation: lit @zxx
scope note: Use for a libelant who takes an appeal from one ecclesiastical court or admiralty to another to reverse the judgment.
in scheme: MARC Code List for Relators
term status: stable

Libelant-appellee
type: Concept
type: Property
notation: lie @zxx
scope note: Use for a libelant against whom an appeal is taken from one ecclesiastical court or admiralty to another to reverse the judgment.
in scheme: MARC Code List for Relators
term status: stable

Libelee
type: Concept
type: Property
notation: lel @zxx
scope note: Use for a party against whom a libel has been filed in an ecclesiastical court or admiralty.
in scheme: MARC Code List for Relators
term status: stable

Libelee-appellant
type: Concept
type: Property
notation: let @zxx
scope note: Use for a libelee who takes an appeal from one ecclesiastical court or admiralty to another to reverse the judgment.
in scheme: MARC Code List for Relators
term status: stable

Libelee-appellee
type: Concept
type: Property
notation: lee @zxx
scope note: Use for a libelee against whom an appeal is taken from one ecclesiastical court or admiralty to another to reverse the judgment.
in scheme: MARC Code List for Relators
term status: stable

Librettist
type: Concept
type: Property
notation: lbt @zxx
scope note: Use for a person or organization who is a writer of the text of an opera, oratorio, etc.
in scheme: MARC Code List for Relators
term status: stable
sub property of: contributor

Licensee
type: Concept
type: Property
notation: lse @zxx
scope note: Use for a person or organization who is an original recipient of the right to print or publish.
in scheme: MARC Code List for Relators
term status: stable

Licensor
type: Concept
type: Property
notation: lso @zxx
scope note: Use for person or organization who is a signer of the license, imprimatur, etc.
in scheme: MARC Code List for Relators
term status: stable
alternative label: Imprimatur

Lighting designer
type: Concept
type: Property
notation: lgd @zxx
scope note: Use for a person or organization who designs the lighting scheme for a theatrical presentation, entertainment, motion picture, etc.
in scheme: MARC Code List for Relators
term status: stable
sub property of: contributor

Lithographer
type: Concept
type: Property
notation: ltg @zxx
scope note: Use for a person or organization who prepares the stone or plate for lithographic printing, including a graphic artist creating a design directly on the surface from which printing will be done.
in scheme: MARC Code List for Relators
term status: stable
sub property of: contributor

Lyricist
type: Concept
type: Property
notation: lyr @zxx
scope note: Use for a person or organization who is the a writer of the text of a song.
in scheme: MARC Code List for Relators
term status: stable
sub property of: contributor

Manufacturer
type: Concept
type: Property
notation: mfr @zxx
scope note: Use for a person or organization that makes an artifactual work (an object made or modified by one or more persons). Examples of artifactual works include vases, cannons or pieces of furniture.
in scheme: MARC Code List for Relators
term status: stable
sub property of: contributor

Marbler
type: Concept
type: Property
notation: mrb @zxx
scope note: Use for the named entity responsible for marbling paper, cloth, leather, etc. used in construction of a resource.
in scheme: MARC Code List for Relators
term status: stable

Markup editor
type: Concept
type: Property
notation: mrk @zxx
scope note: Use for a person or organization performing the coding of SGML, HTML, or XML markup of metadata, text, etc.
in scheme: MARC Code List for Relators
term status: stable

Metadata contact
type: Concept
type: Property
notation: mdc @zxx
scope note: Use for a person or organization primarily responsible for compiling and maintaining the original description of a metadata set (e.g., geospatial metadata set).
in scheme: MARC Code List for Relators
term status: stable

Metal-engraver
type: Concept
type: Property
notation: mte @zxx
scope note: Use for a person or organization responsible for decorations, illustrations, letters, etc. cut on a metal surface for printing or decoration.
in scheme: MARC Code List for Relators
term status: stable
sub property of: contributor

Moderator
type: Concept
type: Property
notation: mod @zxx
scope note: Use for a person who leads a program (often broadcast) where topics are discussed, usually with participation of experts in fields related to the discussion.
in scheme: MARC Code List for Relators
term status: stable
sub property of: contributor

Monitor
type: Concept
type: Property
notation: mon @zxx
scope note: Use for a person or organization that supervises compliance with the contract and is responsible for the report and controls its distribution. Sometimes referred to as the grantee, or controlling agency.
in scheme: MARC Code List for Relators
term status: stable

Music copyist
type: Concept
type: Property
notation: mcp @zxx
scope note: Use for a person who transcribes or copies musical notation.
in scheme: MARC Code List for Relators
term status: stable

Musical director
type: Concept
type: Property
notation: msd @zxx
scope note: Use for a person responsible for basic music decisions about a production, including coordinating the work of the composer, the sound editor, and sound mixers, selecting musicians, and organizing and/or conducting sound for rehearsals and performances.
in scheme: MARC Code List for Relators
term status: stable

Musician
type: Concept
type: Property
notation: mus @zxx
scope note: Use for a person or organization who performs music or contributes to the musical content of a work when it is not possible or desirable to identify the function more precisely.
in scheme: MARC Code List for Relators
term status: stable
sub property of: contributor

Narrator
type: Concept
type: Property
notation: nrt @zxx
scope note: Use for a person who is a speaker relating the particulars of an act, occurrence, or course of events.
in scheme: MARC Code List for Relators
term status: stable
sub property of: contributor

Opponent
type: Concept
type: Property
notation: opn @zxx
scope note: Use for a person or organization responsible for opposing a thesis or dissertation.
in scheme: MARC Code List for Relators
term status: stable

Organizer of meeting
type: Concept
type: Property
notation: orm @zxx
scope note: Use for a person or organization responsible for organizing a meeting for which an item is the report or proceedings.
in scheme: MARC Code List for Relators
term status: stable
sub property of: contributor

Originator
type: Concept
type: Property
notation: org @zxx
scope note: Use for a person or organization performing the work, i.e., the name of a person or organization associated with the intellectual content of the work. This category does not include the publisher or personal affiliation, or sponsor except where it is also the corporate author. Includes a person designated in the work as investigator or principal investigator.
in scheme: MARC Code List for Relators
term status: stable
alternative label: Principal investigator
sub property of: contributor

Other
type: Concept
type: Property
notation: oth @zxx
scope note: Use for relator codes from other lists which have no equivalent in the MARC list or for terms which have not been assigned a code.
in scheme: MARC Code List for Relators
term status: stable

Owner
type: Concept
type: Property
notation: own @zxx
scope note: Use for a person or organization that currently owns an item or collection.
in scheme: MARC Code List for Relators
term status: stable

Papermaker
type: Concept
type: Property
notation: ppm @zxx
scope note: Use for a person or organization responsible for the production of paper, usually from wood, cloth, or other fibrous material.
in scheme: MARC Code List for Relators
term status: stable

Patent applicant
type: Concept
type: Property
notation: pta @zxx
scope note: Use for a person or organization that applied for a patent.
in scheme: MARC Code List for Relators
term status: stable

Patent holder
type: Concept
type: Property
notation: pth @zxx
scope note: Use for a person or organization that was granted the patent referred to by the item.
in scheme: MARC Code List for Relators
term status: stable
alternative label: Patentee

Patron
type: Concept
type: Property
notation: pat @zxx
scope note: Use for a person or organization responsible for commissioning a work. Usually a patron means or influence to support the work of artists, writers, etc. This includes those who commission and pay for individual works.
in scheme: MARC Code List for Relators
term status: stable

Performer
type: Concept
type: Property
notation: prf @zxx
scope note: Use for a person or organization who exhibits musical or acting skills in a musical or dramatic presentation or entertainment, if specific codes for those functions ([act], [dnc], [itr], [voc], etc.) are not used. If specific codes are used, [prf] is used for a person whose principal skill is not known or specified.
in scheme: MARC Code List for Relators
term status: stable
sub property of: contributor

Permitting agency
type: Concept
type: Property
notation: pma @zxx
scope note: Use for an authority (usually a government agency) that issues permits under which work is accomplished.
in scheme: MARC Code List for Relators
term status: stable

Photographer
type: Concept
type: Property
notation: pht @zxx
scope note: Use for a person or organization responsible for taking photographs, whether they are used in their original form or as reproductions.
in scheme: MARC Code List for Relators
term status: stable
sub property of: contributor

Plaintiff
type: Concept
type: Property
notation: ptf @zxx
scope note: Use for the party who complains or sues in court in a personal action, usually in a legal proceeding.
in scheme: MARC Code List for Relators
term status: stable

Plaintiff-appellant
type: Concept
type: Property
notation: ptt @zxx
scope note: Use for a plaintiff who takes an appeal from one court or jurisdiction to another to reverse the judgment, usually in a legal proceeding.
in scheme: MARC Code List for Relators
term status: stable

Plaintiff-appellee
type: Concept
type: Property
notation: pte @zxx
scope note: Use for a plaintiff against whom an appeal is taken from one court or jurisdiction to another to reverse the judgment, usually in a legal proceeding.
in scheme: MARC Code List for Relators
term status: stable

Platemaker
type: Concept
type: Property
notation: plt @zxx
scope note: Use for a person or organization responsible for the production of plates, usually for the production of printed images and/or text.
in scheme: MARC Code List for Relators
term status: stable
sub property of: contributor

Printer
type: Concept
type: Property
notation: prt @zxx
scope note: Use for a person or organization who prints texts, whether from type or plates.
in scheme: MARC Code List for Relators
term status: stable

Printer of plates
type: Concept
type: Property
notation: pop @zxx
scope note: Use for a person or organization who prints illustrations from plates.
in scheme: MARC Code List for Relators
term status: stable
alternative label: Plates, Printer of

Printmaker
type: Concept
type: Property
notation: prm @zxx
scope note: Use for a person or organization who makes a relief, intaglio, or planographic printing surface.
in scheme: MARC Code List for Relators
term status: stable
sub property of: contributor

Process contact
type: Concept
type: Property
notation: prc @zxx
scope note: Use for a person or organization primarily responsible for performing or initiating a process, such as is done with the collection of metadata sets.
in scheme: MARC Code List for Relators
term status: stable

Producer
type: Concept
type: Property
notation: pro @zxx
scope note: Use for a person or organization responsible for the making of a motion picture, including business aspects, management of the productions, and the commercial success of the work.
in scheme: MARC Code List for Relators
term status: stable
sub property of: contributor

Production manager
type: Concept
type: Property
notation: pmm @zxx
scope note: Use for a person responsible for all technical and business matters in a production.
in scheme: MARC Code List for Relators
term status: stable

Production personnel
type: Concept
type: Property
notation: prd @zxx
scope note: Use for a person or organization associated with the production (props, lighting, special effects, etc.) of a musical or dramatic presentation or entertainment.
in scheme: MARC Code List for Relators
term status: stable
sub property of: contributor

Programmer
type: Concept
type: Property
notation: prg @zxx
scope note: Use for a person or organization responsible for the creation and/or maintenance of computer program design documents, source code, and machine-executable digital files and supporting documentation.
in scheme: MARC Code List for Relators
term status: stable
sub property of: contributor

Project director
type: Concept
type: Property
notation: pdr @zxx
scope note: Use for a person or organization with primary responsibility for all essential aspects of a project, or that manages a very large project that demands senior level responsibility, or that has overall responsibility for managing projects, or provides overall direction to a project manager.
in scheme: MARC Code List for Relators
term status: stable

Proofreader
type: Concept
type: Property
notation: pfr @zxx
scope note: Use for a person who corrects printed matter. For manuscripts, use Corrector [crr].
in scheme: MARC Code List for Relators
term status: stable

Publication place
type: Concept
type: Property
notation: pup @zxx
scope note: Use for the name of the place where a resource is published.
in scheme: MARC Code List for Relators
term status: stable

Publisher
type: Concept
type: Property
notation: pbl @zxx
scope note: Use for a person or organization that makes printed matter, often text, but also printed music, artwork, etc. available to the public.
in scheme: MARC Code List for Relators
term status: stable
sub property of: publisher

Publishing director
type: Concept
type: Property
notation: pbd @zxx
scope note: Use for a person or organization who presides over the elaboration of a collective work to ensure its coherence or continuity. This includes editors-in-chief, literary editors, editors of series, etc.
in scheme: MARC Code List for Relators
term status: stable

Puppeteer
type: Concept
type: Property
notation: ppt @zxx
scope note: Use for a person or organization who manipulates, controls, or directs puppets or marionettes in a musical or dramatic presentation or entertainment.
in scheme: MARC Code List for Relators
term status: stable
sub property of: contributor

Recipient
type: Concept
type: Property
notation: rcp @zxx
scope note: Use for a person or organization to whom correspondence is addressed.
in scheme: MARC Code List for Relators
term status: stable

Recording engineer
type: Concept
type: Property
notation: rce @zxx
scope note: Use for a person or organization who supervises the technical aspects of a sound or video recording session.
in scheme: MARC Code List for Relators
term status: stable
sub property of: contributor

Redactor
type: Concept
type: Property
notation: red @zxx
scope note: Use for a person or organization who writes or develops the framework for an item without being intellectually responsible for its content.
in scheme: MARC Code List for Relators
term status: stable

Renderer
type: Concept
type: Property
notation: ren @zxx
scope note: Use for a person or organization who prepares drawings of architectural designs (i.e., renderings) in accurate, representational perspective to show what the project will look like when completed.
in scheme: MARC Code List for Relators
term status: stable
sub property of: contributor

Reporter
type: Concept
type: Property
notation: rpt @zxx
scope note: Use for a person or organization who writes or presents reports of news or current events on air or in print.
in scheme: MARC Code List for Relators
term status: stable
sub property of: contributor

Repository
type: Concept
type: Property
notation: rps @zxx
scope note: Use for an agency that hosts data or material culture objects and provides services to promote long term, consistent and shared use of those data or objects.
in scheme: MARC Code List for Relators
term status: stable

Research team head
type: Concept
type: Property
notation: rth @zxx
scope note: Use for a person who directed or managed a research project.
in scheme: MARC Code List for Relators
term status: stable
sub property of: contributor

Research team member
type: Concept
type: Property
notation: rtm @zxx
scope note: Use for a person who participated in a research project but whose role did not involve direction or management of it.
in scheme: MARC Code List for Relators
term status: stable
sub property of: contributor

Researcher
type: Concept
type: Property
notation: res @zxx
scope note: Use for a person or organization responsible for performing research.
in scheme: MARC Code List for Relators
term status: stable
alternative label: Performer of research
sub property of: contributor

Respondent
type: Concept
type: Property
notation: rsp @zxx
scope note: Use for the party who makes an answer to the courts pursuant to an application for redress, usually in an equity proceeding.
in scheme: MARC Code List for Relators
term status: stable

Respondent-appellant
type: Concept
type: Property
notation: rst @zxx
scope note: Use for a respondent who takes an appeal from one court or jurisdiction to another to reverse the judgment, usually in an equity proceeding.
in scheme: MARC Code List for Relators
term status: stable

Respondent-appellee
type: Concept
type: Property
notation: rse @zxx
scope note: Use for a respondent against whom an appeal is taken from one court or jurisdiction to another to reverse the judgment, usually in an equity proceeding.
in scheme: MARC Code List for Relators
term status: stable

Responsible party
type: Concept
type: Property
notation: rpy @zxx
scope note: Use for a person or organization legally responsible for the content of the published material.
in scheme: MARC Code List for Relators
term status: stable
sub property of: contributor

Restager
type: Concept
type: Property
notation: rsg @zxx
scope note: Use for a person or organization , other than the original choreographer or director, responsible for restaging a choreographic or dramatic work and who contributes minimal new content.
in scheme: MARC Code List for Relators
term status: stable
sub property of: contributor

Reviewer
type: Concept
type: Property
notation: rev @zxx
scope note: Use for a person or organization responsible for the review of a book, motion picture, performance, etc.
in scheme: MARC Code List for Relators
term status: stable
sub property of: contributor

Rubricator
type: Concept
type: Property
notation: rbr @zxx
scope note: Use for a person or organization responsible for parts of a work, often headings or opening parts of a manuscript, that appear in a distinctive color, usually red
in scheme: MARC Code List for Relators
term status: stable

Scenarist
type: Concept
type: Property
notation: sce @zxx
scope note: Use for a person or organization who is the author of a motion picture screenplay.
in scheme: MARC Code List for Relators
term status: stable
sub property of: contributor

Scientific advisor
type: Concept
type: Property
notation: sad @zxx
scope note: Use for a person or organization who brings scientific, pedagogical, or historical competence to the conception and realization on a work, particularly in the case of audio-visual items.
in scheme: MARC Code List for Relators
term status: stable
sub property of: contributor

Scribe
type: Concept
type: Property
notation: scr @zxx
scope note: Use for a person who is an amanuensis and for a writer of manuscripts proper. For a person who makes pen-facsimiles, use Facsimilist [fac].
in scheme: MARC Code List for Relators
term status: stable
sub property of: contributor

Sculptor
type: Concept
type: Property
notation: scl @zxx
scope note: Use for a person or organization who models or carves figures that are three-dimensional representations.
in scheme: MARC Code List for Relators
term status: stable
sub property of: contributor

Second party
type: Concept
type: Property
notation: spy @zxx
scope note: Use for a person or organization who is identified as the party of the second part. In the case of transfer of right, this is the assignee, transferee, licensee, grantee, etc. Multiple parties can be named jointly as the second party
in scheme: MARC Code List for Relators
term status: stable

Secretary
type: Concept
type: Property
notation: sec @zxx
scope note: Use for a person or organization who is a recorder, redactor, or other person responsible for expressing the views of a organization.>
in scheme: MARC Code List for Relators
term status: stable
sub property of: contributor

Set designer
type: Concept
type: Property
notation: std @zxx
scope note: Use for a person or organization who translates the rough sketches of the art director into actual architectural structures for a theatrical presentation, entertainment, motion picture, etc. Set designers draw the detailed guides and specifications for building the set.
in scheme: MARC Code List for Relators
term status: stable
sub property of: contributor

Signer
type: Concept
type: Property
notation: sgn @zxx
scope note: Use for a person whose signature appears without a presentation or other statement indicative of provenance. When there is a presentation statement, use Inscriber [ins].
in scheme: MARC Code List for Relators
term status: stable

Singer
type: Concept
type: Property
notation: sng @zxx
scope note: Use for a person or organization who uses his/her/their voice with or without instrumental accompaniment to produce music. A performance may or may not include actual words.
in scheme: MARC Code List for Relators
term status: stable
sub property of: contributor

Sound designer
type: Concept
type: Property
notation: sds @zxx
scope note: Use for a person who produces and reproduces the sound score (both live and recorded), the installation of microphones, the setting of sound levels, and the coordination of sources of sound for a production.
in scheme: MARC Code List for Relators
term status: stable

Speaker
type: Concept
type: Property
notation: spk @zxx
scope note: Use for a person who participates in a program (often broadcast) and makes a formalized contribution or presentation generally prepared in advance.
in scheme: MARC Code List for Relators
term status: stable
sub property of: contributor

Sponsor
type: Concept
type: Property
notation: spn @zxx
scope note: Use for a person or organization that issued a contract or under the auspices of which a work has been written, printed, published, etc.
in scheme: MARC Code List for Relators
term status: stable

Stage manager
type: Concept
type: Property
notation: stm @zxx
scope note: Use for a person who is in charge of everything that occurs on a performance stage, and who acts as chief of all crews and assistant to a director during rehearsals.
in scheme: MARC Code List for Relators
term status: stable

Standards body
type: Concept
type: Property
notation: stn @zxx
scope note: Use for an organization responsible for the development or enforcement of a standard.
in scheme: MARC Code List for Relators
term status: stable
sub property of: contributor

Stereotyper
type: Concept
type: Property
notation: str @zxx
scope note: Use for a person or organization who creates a new plate for printing by molding or copying another printing surface.
in scheme: MARC Code List for Relators
term status: stable

Storyteller
type: Concept
type: Property
notation: stl @zxx
scope note: Use for a person relaying a story with creative and/or theatrical interpretation.
in scheme: MARC Code List for Relators
term status: stable
sub property of: contributor

Supporting host
type: Concept
type: Property
notation: sht @zxx
scope note: Use for a person or organization that supports (by allocating facilities, staff, or other resources) a project, program, meeting, event, data objects, material culture objects, or other entities capable of support.
in scheme: MARC Code List for Relators
term status: stable
alternative label: Host, Supporting

Surveyor
type: Concept
type: Property
notation: srv @zxx
scope note: Use for a person or organization who does measurements of tracts of land, etc. to determine location, forms, and boundaries.
in scheme: MARC Code List for Relators
term status: stable
sub property of: contributor

Teacher
type: Concept
type: Property
notation: tch @zxx
scope note: Use for a person who, in the context of a resource, gives instruction in an intellectual subject or demonstrates while teaching physical skills.
in scheme: MARC Code List for Relators
term status: stable
alternative label: Instructor
sub property of: contributor

Technical director
type: Concept
type: Property
notation: tcd @zxx
scope note: Use for a person who is ultimately in charge of scenery, props, lights and sound for a production.
in scheme: MARC Code List for Relators
term status: stable

Thesis advisor
type: Concept
type: Property
notation: ths @zxx
scope note: Use for a person under whose supervision a degree candidate develops and presents a thesis, mémoire, or text of a dissertation.
in scheme: MARC Code List for Relators
term status: stable
alternative label: Promoter

Transcriber
type: Concept
type: Property
notation: trc @zxx
scope note: Use for a person who prepares a handwritten or typewritten copy from original material, including from dictated or orally recorded material. For makers of pen-facsimiles, use Facsimilist [fac].
in scheme: MARC Code List for Relators
term status: stable
sub property of: contributor

Translator
type: Concept
type: Property
notation: trl @zxx
scope note: Use for a person or organization who renders a text from one language into another, or from an older form of a language into the modern form.
in scheme: MARC Code List for Relators
term status: stable
sub property of: contributor

Type designer
type: Concept
type: Property
notation: tyd @zxx
scope note: Use for a person or organization who designed the type face used in a particular item.
in scheme: MARC Code List for Relators
term status: stable
alternative label: Designer of type

Typographer
type: Concept
type: Property
notation: tyg @zxx
scope note: Use for a person or organization primarily responsible for choice and arrangement of type used in an item. If the typographer is also responsible for other aspects of the graphic design of a book (e.g., Book designer [bkd]), codes for both functions may be needed.
in scheme: MARC Code List for Relators
term status: stable

University place
type: Concept
type: Property
notation: uvp @zxx
scope note: Use for the name of a place where a university that is associated with a resource is located, for example, a university where an academic dissertation or thesis was presented.
in scheme: MARC Code List for Relators
term status: stable

Videographer
type: Concept
type: Property
notation: vdg @zxx
scope note: Use for a person or organization in charge of a video production, e.g. the video recording of a stage production as opposed to a commercial motion picture. The videographer may be the camera operator or may supervise one or more camera operators. Do not confuse with cinematographer.
in scheme: MARC Code List for Relators
term status: stable
sub property of: contributor

Vocalist
type: Concept
type: Property
notation: voc @zxx
scope note: Use for a person or organization who principally exhibits singing skills in a musical or dramatic presentation or entertainment.
in scheme: MARC Code List for Relators
term status: stable
sub property of: contributor

Witness
type: Concept
type: Property
notation: wit @zxx
scope note: Use for a person who verifies the truthfulness of an event or action.
in scheme: MARC Code List for Relators
term status: stable
alternative label: Deponent
alternative label: Eyewitness
alternative label: Observer
alternative label: Onlooker
alternative label: Testifier

Wood-engraver
type: Concept
type: Property
notation: wde @zxx
scope note: Use for a person or organization who makes prints by cutting the image in relief on the end-grain of a wood block.
in scheme: MARC Code List for Relators
term status: stable
sub property of: contributor

Woodcutter
type: Concept
type: Property
notation: wdc @zxx
scope note: Use for a person or organization who makes prints by cutting the image in relief on the plank side of a wood block.
in scheme: MARC Code List for Relators
term status: stable
sub property of: contributor

Writer of accompanying material
type: Concept
type: Property
notation: wam @zxx
scope note: Use for a person or organization who writes significant material which accompanies a sound recording or other audiovisual material.
in scheme: MARC Code List for Relators
term status: stable
sub property of: contributor

ACT
type: DeprecatedProperty
hidden label: Actor

ADP
type: DeprecatedProperty
hidden label: Adapter

ANL
type: DeprecatedProperty
hidden label: Analyst

ANM
type: DeprecatedProperty
hidden label: Animator

ANN
type: DeprecatedProperty
hidden label: Annotator

APP
type: DeprecatedProperty
hidden label: Applicant

ARC
type: DeprecatedProperty
hidden label: Architect

ARR
type: DeprecatedProperty
hidden label: Arranger

ACP
type: DeprecatedProperty
hidden label: Art copyist

ART
type: DeprecatedProperty
hidden label: Artist

ARD
type: DeprecatedProperty
hidden label: Artistic director

ASG
type: DeprecatedProperty
hidden label: Assignee

ASN
type: DeprecatedProperty
hidden label: Associated name

ATT
type: DeprecatedProperty
hidden label: Attributed name

AUC
type: DeprecatedProperty
hidden label: Auctioneer

AUT
type: DeprecatedProperty
hidden label: Author

AQT
type: DeprecatedProperty
hidden label: Author in quotations or text extracts

AFT
type: DeprecatedProperty
hidden label: Author of afterword, colophon, etc.

AUD
type: DeprecatedProperty
hidden label: Author of dialog

AUI
type: DeprecatedProperty
hidden label: Author of introduction, etc.

AUS
type: DeprecatedProperty
hidden label: Author of screenplay, etc.

ANT
type: DeprecatedProperty
hidden label: Bibliographic antecedent

BND
type: DeprecatedProperty
hidden label: Binder

BDD
type: DeprecatedProperty
hidden label: Binding designer

BLW
type: DeprecatedProperty
hidden label: Blurb writer

BKD
type: DeprecatedProperty
hidden label: Book designer

BKP
type: DeprecatedProperty
hidden label: Book producer

BJD
type: DeprecatedProperty
hidden label: Bookjacket designer

BPD
type: DeprecatedProperty
hidden label: Bookplate designer

BSL
type: DeprecatedProperty
hidden label: Bookseller

CLL
type: DeprecatedProperty
hidden label: Calligrapher

CTG
type: DeprecatedProperty
hidden label: Cartographer

CNS
type: DeprecatedProperty
hidden label: Censor

CHR
type: DeprecatedProperty
hidden label: Choreographer

CNG
type: DeprecatedProperty
hidden label: Cinematographer

CLI
type: DeprecatedProperty
hidden label: Client

CLB
type: DeprecatedProperty
hidden label: Collaborator

COL
type: DeprecatedProperty
hidden label: Collector

CLT
type: DeprecatedProperty
hidden label: Collotyper

CLR
type: DeprecatedProperty
hidden label: Colorist

CMM
type: DeprecatedProperty
hidden label: Commentator

CWT
type: DeprecatedProperty
hidden label: Commentator for written text

COM
type: DeprecatedProperty
hidden label: Compiler

CPL
type: DeprecatedProperty
hidden label: Complainant

CPT
type: DeprecatedProperty
hidden label: Complainant-appellant

CPE
type: DeprecatedProperty
hidden label: Complainant-appellee

CMP
type: DeprecatedProperty
hidden label: Composer

CMT
type: DeprecatedProperty
hidden label: Compositor

CCP
type: DeprecatedProperty
hidden label: Conceptor

CND
type: DeprecatedProperty
hidden label: Conductor

CON
type: DeprecatedProperty
hidden label: Conservator

CSL
type: DeprecatedProperty
hidden label: Consultant

CSP
type: DeprecatedProperty
hidden label: Consultant to a project

COS
type: DeprecatedProperty
hidden label: Contestant

COT
type: DeprecatedProperty
hidden label: Contestant-appellant

COE
type: DeprecatedProperty
hidden label: Contestant-appellee

CTS
type: DeprecatedProperty
hidden label: Contestee

CTT
type: DeprecatedProperty
hidden label: Contestee-appellant

CTE
type: DeprecatedProperty
hidden label: Contestee-appellee

CTR
type: DeprecatedProperty
hidden label: Contractor

CTB
type: DeprecatedProperty
hidden label: Contributor

CPC
type: DeprecatedProperty
hidden label: Copyright claimant

CPH
type: DeprecatedProperty
hidden label: Copyright holder

CRR
type: DeprecatedProperty
hidden label: Corrector

CRP
type: DeprecatedProperty
hidden label: Correspondent

CST
type: DeprecatedProperty
hidden label: Costume designer

COV
type: DeprecatedProperty
hidden label: Cover designer

CRE
type: DeprecatedProperty
hidden label: Creator

CUR
type: DeprecatedProperty
hidden label: Curator of an exhibition

DNC
type: DeprecatedProperty
hidden label: Dancer

DTC
type: DeprecatedProperty
hidden label: Data contributor

DTM
type: DeprecatedProperty
hidden label: Data manager

DTE
type: DeprecatedProperty
hidden label: Dedicatee

DTO
type: DeprecatedProperty
hidden label: Dedicator

DFD
type: DeprecatedProperty
hidden label: Defendant

DFT
type: DeprecatedProperty
hidden label: Defendant-appellant

DFE
type: DeprecatedProperty
hidden label: Defendant-appellee

DGG
type: DeprecatedProperty
hidden label: Degree grantor

DLN
type: DeprecatedProperty
hidden label: Delineator

DPC
type: DeprecatedProperty
hidden label: Depicted

DPT
type: DeprecatedProperty
hidden label: Depositor

DSR
type: DeprecatedProperty
hidden label: Designer

DRT
type: DeprecatedProperty
hidden label: Director

DIS
type: DeprecatedProperty
hidden label: Dissertant

DBP
type: DeprecatedProperty
hidden label: Distribution place

DST
type: DeprecatedProperty
hidden label: Distributor

DNR
type: DeprecatedProperty
hidden label: Donor

DRM
type: DeprecatedProperty
hidden label: Draftsman

DUB
type: DeprecatedProperty
hidden label: Dubious author

EDT
type: DeprecatedProperty
hidden label: Editor

ELG
type: DeprecatedProperty
hidden label: Electrician

ELT
type: DeprecatedProperty
hidden label: Electrotyper

ENG
type: DeprecatedProperty
hidden label: Engineer

EGR
type: DeprecatedProperty
hidden label: Engraver

ETR
type: DeprecatedProperty
hidden label: Etcher

EVP
type: DeprecatedProperty
hidden label: Event place

EXP
type: DeprecatedProperty
hidden label: Expert

FAC
type: DeprecatedProperty
hidden label: Facsimilist

FLD
type: DeprecatedProperty
hidden label: Field director

FLM
type: DeprecatedProperty
hidden label: Film editor

FPY
type: DeprecatedProperty
hidden label: First party

FRG
type: DeprecatedProperty
hidden label: Forger

FMO
type: DeprecatedProperty
hidden label: Former owner

FND
type: DeprecatedProperty
hidden label: Funder

GIS
type: DeprecatedProperty
hidden label: Geographic information specialist

HNR
type: DeprecatedProperty
hidden label: Honoree

HST
type: DeprecatedProperty
hidden label: Host

ILU
type: DeprecatedProperty
hidden label: Illuminator

ILL
type: DeprecatedProperty
hidden label: Illustrator

INS
type: DeprecatedProperty
hidden label: Inscriber

ITR
type: DeprecatedProperty
hidden label: Instrumentalist

IVE
type: DeprecatedProperty
hidden label: Interviewee

IVR
type: DeprecatedProperty
hidden label: Interviewer

INV
type: DeprecatedProperty
hidden label: Inventor

LBR
type: DeprecatedProperty
hidden label: Laboratory

LDR
type: DeprecatedProperty
hidden label: Laboratory director

LED
type: DeprecatedProperty
hidden label: Lead

LSA
type: DeprecatedProperty
hidden label: Landscape architect

LEN
type: DeprecatedProperty
hidden label: Lender

LIL
type: DeprecatedProperty
hidden label: Libelant

LIT
type: DeprecatedProperty
hidden label: Libelant-appellant

LIE
type: DeprecatedProperty
hidden label: Libelant-appellee

LEL
type: DeprecatedProperty
hidden label: Libelee

LET
type: DeprecatedProperty
hidden label: Libelee-appellant

LEE
type: DeprecatedProperty
hidden label: Libelee-appellee

LBT
type: DeprecatedProperty
hidden label: Librettist

LSE
type: DeprecatedProperty
hidden label: Licensee

LSO
type: DeprecatedProperty
hidden label: Licensor

LGD
type: DeprecatedProperty
hidden label: Lighting designer

LTG
type: DeprecatedProperty
hidden label: Lithographer

LYR
type: DeprecatedProperty
hidden label: Lyricist

MFR
type: DeprecatedProperty
hidden label: Manufacturer

MRB
type: DeprecatedProperty
hidden label: Marbler

MRK
type: DeprecatedProperty
hidden label: Markup editor

MDC
type: DeprecatedProperty
hidden label: Metadata contact

MTE
type: DeprecatedProperty
hidden label: Metal-engraver

MOD
type: DeprecatedProperty
hidden label: Moderator

MON
type: DeprecatedProperty
hidden label: Monitor

MCP
type: DeprecatedProperty
hidden label: Music copyist

MSD
type: DeprecatedProperty
hidden label: Musical director

MUS
type: DeprecatedProperty
hidden label: Musician

NRT
type: DeprecatedProperty
hidden label: Narrator

OPN
type: DeprecatedProperty
hidden label: Opponent

ORM
type: DeprecatedProperty
hidden label: Organizer of meeting

ORG
type: DeprecatedProperty
hidden label: Originator

OTH
type: DeprecatedProperty
hidden label: Other

OWN
type: DeprecatedProperty
hidden label: Owner

PPM
type: DeprecatedProperty
hidden label: Papermaker

PTA
type: DeprecatedProperty
hidden label: Patent applicant

PTH
type: DeprecatedProperty
hidden label: Patent holder

PAT
type: DeprecatedProperty
hidden label: Patron

PRF
type: DeprecatedProperty
hidden label: Performer

PMA
type: DeprecatedProperty
hidden label: Permitting agency

PHT
type: DeprecatedProperty
hidden label: Photographer

PTF
type: DeprecatedProperty
hidden label: Plaintiff

PTT
type: DeprecatedProperty
hidden label: Plaintiff-appellant

PTE
type: DeprecatedProperty
hidden label: Plaintiff-appellee

PLT
type: DeprecatedProperty
hidden label: Platemaker

PRT
type: DeprecatedProperty
hidden label: Printer

POP
type: DeprecatedProperty
hidden label: Printer of plates

PRM
type: DeprecatedProperty
hidden label: Printmaker

PRC
type: DeprecatedProperty
hidden label: Process contact

PRO
type: DeprecatedProperty
hidden label: Producer

PMM
type: DeprecatedProperty
hidden label: Production manager

PRD
type: DeprecatedProperty
hidden label: Production personnel

PRG
type: DeprecatedProperty
hidden label: Programmer

PDR
type: DeprecatedProperty
hidden label: Project director

PFR
type: DeprecatedProperty
hidden label: Proofreader

PUP
type: DeprecatedProperty
hidden label: Publication place

PBL
type: DeprecatedProperty
hidden label: Publisher

PBD
type: DeprecatedProperty
hidden label: Publishing director

PPT
type: DeprecatedProperty
hidden label: Puppeteer

RCP
type: DeprecatedProperty
hidden label: Recipient

RCE
type: DeprecatedProperty
hidden label: Recording engineer

RED
type: DeprecatedProperty
hidden label: Redactor

REN
type: DeprecatedProperty
hidden label: Renderer

RPT
type: DeprecatedProperty
hidden label: Reporter

RPS
type: DeprecatedProperty
hidden label: Repository

RTH
type: DeprecatedProperty
hidden label: Research team head

RTM
type: DeprecatedProperty
hidden label: Research team member

RES
type: DeprecatedProperty
hidden label: Researcher

RSP
type: DeprecatedProperty
hidden label: Respondent

RST
type: DeprecatedProperty
hidden label: Respondent-appellant

RSE
type: DeprecatedProperty
hidden label: Respondent-appellee

RPY
type: DeprecatedProperty
hidden label: Responsible party

RSG
type: DeprecatedProperty
hidden label: Restager

REV
type: DeprecatedProperty
hidden label: Reviewer

RBR
type: DeprecatedProperty
hidden label: Rubricator

SCE
type: DeprecatedProperty
hidden label: Scenarist

SAD
type: DeprecatedProperty
hidden label: Scientific advisor

SCR
type: DeprecatedProperty
hidden label: Scribe

SCL
type: DeprecatedProperty
hidden label: Sculptor

SPY
type: DeprecatedProperty
hidden label: Second party

SEC
type: DeprecatedProperty
hidden label: Secretary

STD
type: DeprecatedProperty
hidden label: Set designer

SGN
type: DeprecatedProperty
hidden label: Signer

SNG
type: DeprecatedProperty
hidden label: Singer

SDS
type: DeprecatedProperty
hidden label: Sound designer

SPK
type: DeprecatedProperty
hidden label: Speaker

SPN
type: DeprecatedProperty
hidden label: Sponsor

STM
type: DeprecatedProperty
hidden label: Stage manager

STN
type: DeprecatedProperty
hidden label: Standards body

STR
type: DeprecatedProperty
hidden label: Stereotyper

STL
type: DeprecatedProperty
hidden label: Storyteller

SHT
type: DeprecatedProperty
hidden label: Supporting host

SRV
type: DeprecatedProperty
hidden label: Surveyor

TCH
type: DeprecatedProperty
hidden label: Teacher

TCD
type: DeprecatedProperty
hidden label: Technical director

THS
type: DeprecatedProperty
hidden label: Thesis advisor

TRC
type: DeprecatedProperty
hidden label: Transcriber

TRL
type: DeprecatedProperty
hidden label: Translator

TYD
type: DeprecatedProperty
hidden label: Type designer

TYG
type: DeprecatedProperty
hidden label: Typographer

UVP
type: DeprecatedProperty
hidden label: University place

VDG
type: DeprecatedProperty
hidden label: Videographer

VOC
type: DeprecatedProperty
hidden label: Vocalist

WIT
type: DeprecatedProperty
hidden label: Witness

WDE
type: DeprecatedProperty
hidden label: Wood-engraver

WDC
type: DeprecatedProperty
hidden label: Woodcutter

WAM
type: DeprecatedProperty
hidden label: Writer of accompanying material